{"text_format":"1","workbook":"xlsx","n_sheets":12,"sheets":["Input","Summary","EAR_Map","Populate DCN","Headworks","Reserves","Roading","EAR","Calculation Links","Policy Inputs","Validation Lists","Version History"],"not_rendered":{"charts":0,"images":1,"macros":1,"external_links":1,"defined_names":329,"comments":4,"pivot_tables":0},"unopened":[],"bounds":{"document_bytes":16777216,"sheet_cells":100000,"rows_first":2000,"rows_last":500,"rows_between":2000,"halvings":0,"cell_chars":16384,"cell_head_chars":4096},"cells_cut":0,"cells_raw":0,"read":"whole","date_system":"1900"}

{"sheet":"Input","index":0,"n_rows":80,"n_cols":9,"rows_kept":80,"cut":false,"hidden":false,"merged":[[21,1,21,3],[41,1,41,3]]}
[]
[]
[]
[]
[]
[]
{"$rows_left_out":75}
{"sheet":"Summary","index":1,"n_rows":17,"n_cols":13,"rows_kept":17,"cut":false,"hidden":false,"merged":[[15,2,15,6],[16,2,16,6]]}
[null,"Development Contributions - Summary"]
[]
[null,"For Consent No.",{"$f":"Consent_Number","v":0}]
[null,null,null,null,null,null,null,null,null,null,null,{"$f":"IF(ROUND(SUM(L6:M14),0)=0,\"OK\",\"check\")","v":"OK"}]
[null,"Activity","Demand Post Development (DE)","Credits for Existing Demand  (DE)","Additional Demand (DE)","Development Contribution per DE ($)","Development Contribution (Excl GST)","GST","Development Contribution (Incl GST)"]
[null,"Water Supply Contribution:",{"$f":"+Headworks!B272","v":0},{"$f":"+Headworks!B271","v":0},{"$f":"Headworks!B273","v":0},{"$f":"+Headworks!B274","v":0},{"$f":"+Headworks!B275","v":0},{"$f":"+Headworks!C275","v":0},{"$f":"+Headworks!D275","v":0},null,{"$f":"IFERROR(IF(E6<=0,0,E6*F6),IF(AND(C6=\"Not Required\",E6=\"\",F6=\"\"),0))","v":0},{"$f":"IF(ROUND(K6-G6,0)=0,0,1)","v":0},{"$f":"IF(E6=0,0,IF(C6-D6=E6,0,1))","v":0}]
{"$rows_left_out":12}
{"sheet":"EAR_Map","index":2,"n_rows":0,"n_cols":0,"rows_kept":0,"cut":false,"hidden":false,"merged":[]}

{"sheet":"Populate DCN","index":3,"n_rows":56,"n_cols":10,"rows_kept":56,"cut":false,"hidden":true,"merged":[]}
["Field","Value","* Make sure Document to Populate is Closed first"]
[]
[]
["demand_For",{"$f":"D7&E7&F7&G7&H7&I7&J7","v":""},null,{"$f":"IF(ws_Ttl_ex>0,\"Water Supply\",\"\")","v":""},{"$f":"IF(ww_Ttl_ex>0,\"Wastewater\",\"\")","v":""},{"$f":"IF(sw_Ttl_ex>0,\"Stormwater\",\"\")","v":""},{"$f":"IF(resImp_Ttl_ex>0,\"Reserve Improvements\",\"\")","v":""},{"$f":"IF(comFac_Ttl_ex>0,\"Community Facilities\",\"\")","v":""},{"$f":"IF(resLand_Ttl_ex>0,\"Reserve Land\",\"\")","v":""},{"$f":"IF(trprt_Ttl_ex>0,\"Roading\",\"\")","v":""}]
[null,null,null,{"$f":"IF(D4=\"\",\"\",D4&\", \")","v":""},"","","","","",""]
["policyYear",{"$f":"Policy_Year_Input","v":"2018/19"},null,{"$f":"IF(D4=\"\",\"\",\"and \"&D4)","v":""},"","","","","",""]
{"$rows_left_out":51}
{"sheet":"Headworks","index":4,"n_rows":289,"n_cols":8,"rows_kept":289,"cut":false,"hidden":true,"merged":[]}
["Pre Development/Subdivision Demand (Credits) - WS, WW & SW"]
["For Consent No.",{"$f":"IF(Consent_Number=\"\",\"\",Consent_Number)","v":""},null,null,null,"No. of Land Uses",{"$f":"Number_Land_Uses","v":0}]
[]
["Location:",{"$f":"IF(Location=\"\",\"\",Location)","v":""},null,{"$f":"IF($B$4=\"\",\"\",VLOOKUP(B4,Ward,9,0))","v":""}]
[]
[{"$f":"IF($G$2=\"1\",\"Land Use Category:\",\"1st Land Use Category:\")","v":"1st Land Use Category:"},{"$f":"IF(Land_Use_Category_1_Credits=\"\",\"\",Land_Use_Category_1_Credits)","v":""},null,null,null,"No. of Residential Units:",{"$f":"IF(No_Res_Units_LU1_Credits=\"\",\"\",No_Res_Units_LU1_Credits)","v":""}]
{"$rows_left_out":284}
{"sheet":"Reserves","index":5,"n_rows":254,"n_cols":8,"rows_kept":254,"cut":false,"hidden":true,"merged":[]}
["Pre Development/Subdivision Demand (Credits) - Reserves"]
["For Consent No.",{"$f":"IF(Consent_Number=\"\",\"\",Consent_Number)","v":""},null,null,null,"No. of Land Uses",{"$f":"Number_Land_Uses","v":0}]
[]
["Location:",{"$f":"IF(Location=\"\",\"\",Location)","v":""},null,{"$f":"IF($B$4=\"\",\"\",VLOOKUP(B4,Ward,9,0))","v":""}]
[]
[{"$f":"IF(F2=\"1\",\"Land Use Category:\",\"1st Land Use Category:\")","v":"1st Land Use Category:"},{"$f":"IF(Land_Use_Category_1_Credits=\"\",\"\",Land_Use_Category_1_Credits)","v":""},null,null,null,"No. of Residential Units:",{"$f":"IF(No_Res_Units_LU1_Credits=\"\",\"\",No_Res_Units_LU1_Credits)","v":""}]
{"$rows_left_out":249}
{"sheet":"Roading","index":6,"n_rows":109,"n_cols":8,"rows_kept":109,"cut":false,"hidden":true,"merged":[]}
["Pre Development/Subdivision Demand (Credits) - Roading"]
["For Consent No.",{"$f":"Headworks!$B$2","v":""},null,null,null,"No. of Land Uses",{"$f":"Number_Land_Uses","v":0}]
[]
["Location:",{"$f":"IF(Location=\"\",\"\",Location)","v":""},null,{"$f":"IF($B$4=\"\",\"\",VLOOKUP(B4,Ward,9,0))","v":""}]
[]
[{"$f":"IF(F2=\"1\",\"Land Use Category:\",\"1st Land Use Category:\")","v":"1st Land Use Category:"},{"$f":"IF(Land_Use_Category_1_Credits=\"\",\"\",Land_Use_Category_1_Credits)","v":""},null,null,null,"No. of Residential Units:",{"$f":"IF(No_Res_Units_LU1_Credits=\"\",\"\",No_Res_Units_LU1_Credits)","v":""}]
{"$rows_left_out":104}
{"sheet":"EAR","index":7,"n_rows":108,"n_cols":8,"rows_kept":108,"cut":false,"hidden":true,"merged":[]}
["Pre Development/Subdivision Demand (Credits) - Roading - EAR"]
["For Consent No.",{"$f":"Headworks!$B$2","v":""},null,null,null,"No. of Land Uses",{"$f":"Number_Land_Uses","v":0}]
[]
["Location:",{"$f":"IF(Location=\"\",\"\",Location)","v":""},null,{"$f":"IF($B$4=\"\",\"\",VLOOKUP(B4,Ward,9,0))","v":""}]
[]
[{"$f":"IF(F2=\"1\",\"Land Use Category:\",\"1st Land Use Category:\")","v":"1st Land Use Category:"},{"$f":"IF(Land_Use_Category_1_Credits=\"\",\"\",Land_Use_Category_1_Credits)","v":""},null,null,null,"No. of Residential Units:",{"$f":"IF(No_Res_Units_LU1_Credits=\"\",\"\",No_Res_Units_LU1_Credits)","v":""}]
{"$rows_left_out":103}
{"sheet":"Calculation Links","index":8,"n_rows":67,"n_cols":41,"rows_kept":67,"cut":false,"hidden":true,"merged":[[2,32,2,33],[2,28,2,29],[2,30,2,31],[2,10,2,11],[2,14,2,15],[2,16,2,17],[2,24,2,25],[2,18,2,19]]}
["Standard Contributions",null,null,null,null,null,null,null,null,"Land Use Differentials","Use for post development",null,null,null,null,null,null,null,null,null,{"$f":"+HLOOKUP(U$24,Differentials,2,FALSE)","v":12},null,null,"Land Use Differentials","Use for pre development (credits)"]
[]
[null,null,null,null,null,null,null,null,null,null,"Water Supply",null,"Wastewater","Stormwater","Reserve Improvements & Community Facilities",null,"Reserve Land",null,"Roading",null,"Roading - EAR",null,null,null,"Water Supply",null,"Wastewater","Stormwater","Reserve Improvements & Community Facilities",null,"Reserve Land",null,"Roading",null,"Roading - EAR"]
[null,"Water Supply","Wastewater","Stormwater","Reserve Improvements","Community Facilities","Transportation","Transportation - EAR",null,null,"Dwelling Equivalents per 100m² GFA","Plus Network Factor Dwelling Equivalents","Dwelling Equivalents per 100m² GFA","Dwelling Equivalents per 100m² Impervious Surface Area","Dwelling Equivalents per 100m² GFA for Wakatipu","Dwelling Equivalents per 100m² GFA for Wanaka","Dwelling Equivalents per 100m² GFA for Wakatipu","Dwelling Equivalents per 100m² GFA for Wanaka","Dwelling Equivalents per 100m² GFA for Wakatipu","Dwelling Equivalents per 100m² GFA for Wanaka","Dwelling Equivalents per 100m² GFA for Wakatipu",null,null,null,"Dwelling Equivalents per 100m² GFA","Plus Network Factor Dwelling Equivalents","Dwelling Equivalents per 100m² GFA","Dwelling Equivalents per 100m² Impervious Surface Area","Dwelling Equivalents per 100m² GFA for Wakatipu","Dwelling Equivalents per 100m² GFA for Wanaka","Dwelling Equivalents per 100m² GFA for Wakatipu","Dwelling Equivalents per 100m² GFA for Wanaka","Dwelling Equivalents per 100m² GFA for Wakatipu","Dwelling Equivalents per 100m² GFA for Wanaka","Dwelling Equivalents per 100m² GFA for Wakatipu"]
["Queenstown",{"$f":"VLOOKUP(Policy_Year_Input&'Calculation Links'!$A5,Standard_Contributions,HLOOKUP(B$4,Standard_Contributions,2,FALSE),FALSE)","v":3885},{"$f":"VLOOKUP(Policy_Year_Input&'Calculation Links'!$A5,Standard_Contributions,HLOOKUP(C$4,Standard_Contributions,2,FALSE),FALSE)","v":4693},{"$f":"VLOOKUP(Policy_Year_Input&'Calculation Links'!$A5,Standard_Contributions,HLOOKUP(D$4,Standard_Contributions,2,FALSE),FALSE)","v":1944},{"$f":"VLOOKUP(Policy_Year_Input&'Calculation Links'!$A5,Standard_Contributions,HLOOKUP(E$4,Standard_Contributions,2,FALSE),FALSE)","v":762},{"$f":"VLOOKUP(Policy_Year_Input&'Calculation Links'!$A5,Standard_Contributions,HLOOKUP(F$4,Standard_Contributions,2,FALSE),FALSE)","v":1327},{"$f":"VLOOKUP(Policy_Year_Input&'Calculation Links'!$A5,Standard_Contributions,HLOOKUP(G$4,Standard_Contributions,2,FALSE),FALSE)","v":5018},{"$f":"VLOOKUP(Policy_Year_Input&'Calculation Links'!$A5,Standard_Contributions,HLOOKUP(H$4,Standard_Contributions,2,FALSE),FALSE)","v":734},{"$f":"+$D$50","v":"Wakatipu"},"Residential",{"$f":"VLOOKUP(Policy_Year_Input&'Calculation Links'!$J5,Differentials,HLOOKUP(K$24,Differentials,2,FALSE),FALSE)","v":1},{"$f":"VLOOKUP(Policy_Year_Input&'Calculation Links'!$J5,Differentials,HLOOKUP(L$24,Differentials,2,FALSE),FALSE)","v":0},{"$f":"VLOOKUP(Policy_Year_Input&'Calculation Links'!$J5,Differentials,HLOOKUP(M$24,Differentials,2,FALSE),FALSE)","v":1},{"$f":"VLOOKUP(Policy_Year_Input&'Calculation Links'!$J5,Differentials,HLOOKUP(N$24,Differentials,2,FALSE),FALSE)","v":1},{"$f":"VLOOKUP(Policy_Year_Input&'Calculation Links'!$J5,Differentials,HLOOKUP(O$24,Differentials,2,FALSE),FALSE)","v":1},{"$f":"VLOOKUP(Policy_Year_Input&'Calculation Links'!$J5,Differentials,HLOOKUP(P$24,Differentials,2,FALSE),FALSE)","v":1},{"$f":"VLOOKUP(Policy_Year_Input&'Calculation Links'!$J5,Differentials,HLOOKUP(Q$24,Differentials,2,FALSE),FALSE)","v":1},{"$f":"VLOOKUP(Policy_Year_Input&'Calculation Links'!$J5,Differentials,HLOOKUP(R$24,Differentials,2,FALSE),FALSE)","v":1},{"$f":"VLOOKUP(Policy_Year_Input&'Calculation Links'!$J5,Differentials,HLOOKUP(S$24,Differentials,2,FALSE),FALSE)","v":1},{"$f":"VLOOKUP(Policy_Year_Input&'Calculation Links'!$J5,Differentials,HLOOKUP(T$24,Differentials,2,FALSE),FALSE)","v":1},{"$f":"VLOOKUP(Policy_Year_Input&'Calculation Links'!$J5,Differentials,HLOOKUP(U$24,Differentials,2,FALSE),FALSE)","v":1},{"$f":"IF(Policy_Year_Input=\"2018/19\",\"NR\",W5)","v":"NR"},"R","Residential",{"$f":"VLOOKUP(Credits_PolicyYear_Input&'Calculation Links'!$J5,Differentials,HLOOKUP(Y$24,Differentials,2,FALSE),FALSE)","v":{"$error":"#N/A"}},{"$f":"VLOOKUP(Credits_PolicyYear_Input&'Calculation Links'!$J5,Differentials,HLOOKUP(Z$24,Differentials,2,FALSE),FALSE)","v":{"$error":"#N/A"}},{"$f":"VLOOKUP(Credits_PolicyYear_Input&'Calculation Links'!$J5,Differentials,HLOOKUP(AA$24,Differentials,2,FALSE),FALSE)","v":{"$error":"#N/A"}},{"$f":"VLOOKUP(Credits_PolicyYear_Input&'Calculation Links'!$J5,Differentials,HLOOKUP(AB$24,Differentials,2,FALSE),FALSE)","v":{"$error":"#N/A"}},{"$f":"VLOOKUP(Credits_PolicyYear_Input&'Calculation Links'!$J5,Differentials,HLOOKUP(AC$24,Differentials,2,FALSE),FALSE)","v":{"$error":"#N/A"}},{"$f":"VLOOKUP(Credits_PolicyYear_Input&'Calculation Links'!$J5,Differentials,HLOOKUP(AD$24,Differentials,2,FALSE),FALSE)","v":{"$error":"#N/A"}},{"$f":"VLOOKUP(Credits_PolicyYear_Input&'Calculation Links'!$J5,Differentials,HLOOKUP(AE$24,Differentials,2,FALSE),FALSE)","v":{"$error":"#N/A"}},{"$f":"VLOOKUP(Credits_PolicyYear_Input&'Calculation Links'!$J5,Differentials,HLOOKUP(AF$24,Differentials,2,FALSE),FALSE)","v":{"$error":"#N/A"}},{"$f":"VLOOKUP(Credits_PolicyYear_Input&'Calculation Links'!$J5,Differentials,HLOOKUP(AG$24,Differentials,2,FALSE),FALSE)","v":{"$error":"#N/A"}},{"$f":"VLOOKUP(Credits_PolicyYear_Input&'Calculation Links'!$J5,Differentials,HLOOKUP(AH$24,Differentials,2,FALSE),FALSE)","v":{"$error":"#N/A"}},{"$f":"VLOOKUP(Credits_PolicyYear_Input&'Calculation Links'!$J5,Differentials,HLOOKUP(AI$24,Differentials,2,FALSE),FALSE)","v":{"$error":"#N/A"}},{"$f":"IF(Credits_PolicyYear_Input=\"2018/19\",\"NR\",AK5)","v":"R"},"R",null,null,"Queenstown","Urban"]
["Frankton Flats",{"$f":"VLOOKUP(Policy_Year_Input&'Calculation Links'!$A6,Standard_Contributions,HLOOKUP(B$4,Standard_Contributions,2,FALSE),FALSE)","v":3885},{"$f":"VLOOKUP(Policy_Year_Input&'Calculation Links'!$A6,Standard_Contributions,HLOOKUP(C$4,Standard_Contributions,2,FALSE),FALSE)","v":4693},{"$f":"VLOOKUP(Policy_Year_Input&'Calculation Links'!$A6,Standard_Contributions,HLOOKUP(D$4,Standard_Contributions,2,FALSE),FALSE)","v":3296},{"$f":"VLOOKUP(Policy_Year_Input&'Calculation Links'!$A6,Standard_Contributions,HLOOKUP(E$4,Standard_Contributions,2,FALSE),FALSE)","v":762},{"$f":"VLOOKUP(Policy_Year_Input&'Calculation Links'!$A6,Standard_Contributions,HLOOKUP(F$4,Standard_Contributions,2,FALSE),FALSE)","v":1327},{"$f":"VLOOKUP(Policy_Year_Input&'Calculation Links'!$A6,Standard_Contributions,HLOOKUP(G$4,Standard_Contributions,2,FALSE),FALSE)","v":5018},{"$f":"VLOOKUP(Policy_Year_Input&'Calculation Links'!$A6,Standard_Contributions,HLOOKUP(H$4,Standard_Contributions,2,FALSE),FALSE)","v":734},"Wakatipu","Residential Flat",{"$f":"VLOOKUP(Policy_Year_Input&'Calculation Links'!$J6,Differentials,HLOOKUP(K$24,Differentials,2,FALSE),FALSE)","v":0.71},{"$f":"VLOOKUP(Policy_Year_Input&'Calculation Links'!$J6,Differentials,HLOOKUP(L$24,Differentials,2,FALSE),FALSE)","v":0},{"$f":"VLOOKUP(Policy_Year_Input&'Calculation Links'!$J6,Differentials,HLOOKUP(M$24,Differentials,2,FALSE),FALSE)","v":0.71},{"$f":"VLOOKUP(Policy_Year_Input&'Calculation Links'!$J6,Differentials,HLOOKUP(N$24,Differentials,2,FALSE),FALSE)","v":0.38},{"$f":"VLOOKUP(Policy_Year_Input&'Calculation Links'!$J6,Differentials,HLOOKUP(O$24,Differentials,2,FALSE),FALSE)","v":0.71},{"$f":"VLOOKUP(Policy_Year_Input&'Calculation Links'!$J6,Differentials,HLOOKUP(P$24,Differentials,2,FALSE),FALSE)","v":0.71},{"$f":"VLOOKUP(Policy_Year_Input&'Calculation Links'!$J6,Differentials,HLOOKUP(Q$24,Differentials,2,FALSE),FALSE)","v":0.71},{"$f":"VLOOKUP(Policy_Year_Input&'Calculation Links'!$J6,Differentials,HLOOKUP(R$24,Differentials,2,FALSE),FALSE)","v":0.71},{"$f":"VLOOKUP(Policy_Year_Input&'Calculation Links'!$J6,Differentials,HLOOKUP(S$24,Differentials,2,FALSE),FALSE)","v":0.71},{"$f":"VLOOKUP(Policy_Year_Input&'Calculation Links'!$J6,Differentials,HLOOKUP(T$24,Differentials,2,FALSE),FALSE)","v":0.71},{"$f":"VLOOKUP(Policy_Year_Input&'Calculation Links'!$J6,Differentials,HLOOKUP(U$24,Differentials,2,FALSE),FALSE)","v":0.71},"NR","R","Residential Flat",{"$f":"VLOOKUP(Credits_PolicyYear_Input&'Calculation Links'!$J6,Differentials,HLOOKUP(Y$24,Differentials,2,FALSE),FALSE)","v":{"$error":"#N/A"}},{"$f":"VLOOKUP(Credits_PolicyYear_Input&'Calculation Links'!$J6,Differentials,HLOOKUP(Z$24,Differentials,2,FALSE),FALSE)","v":{"$error":"#N/A"}},{"$f":"VLOOKUP(Credits_PolicyYear_Input&'Calculation Links'!$J6,Differentials,HLOOKUP(AA$24,Differentials,2,FALSE),FALSE)","v":{"$error":"#N/A"}},{"$f":"VLOOKUP(Credits_PolicyYear_Input&'Calculation Links'!$J6,Differentials,HLOOKUP(AB$24,Differentials,2,FALSE),FALSE)","v":{"$error":"#N/A"}},{"$f":"VLOOKUP(Credits_PolicyYear_Input&'Calculation Links'!$J6,Differentials,HLOOKUP(AC$24,Differentials,2,FALSE),FALSE)","v":{"$error":"#N/A"}},{"$f":"VLOOKUP(Credits_PolicyYear_Input&'Calculation Links'!$J6,Differentials,HLOOKUP(AD$24,Differentials,2,FALSE),FALSE)","v":{"$error":"#N/A"}},{"$f":"VLOOKUP(Credits_PolicyYear_Input&'Calculation Links'!$J6,Differentials,HLOOKUP(AE$24,Differentials,2,FALSE),FALSE)","v":{"$error":"#N/A"}},{"$f":"VLOOKUP(Credits_PolicyYear_Input&'Calculation Links'!$J6,Differentials,HLOOKUP(AF$24,Differentials,2,FALSE),FALSE)","v":{"$error":"#N/A"}},{"$f":"VLOOKUP(Credits_PolicyYear_Input&'Calculation Links'!$J6,Differentials,HLOOKUP(AG$24,Differentials,2,FALSE),FALSE)","v":{"$error":"#N/A"}},{"$f":"VLOOKUP(Credits_PolicyYear_Input&'Calculation Links'!$J6,Differentials,HLOOKUP(AH$24,Differentials,2,FALSE),FALSE)","v":{"$error":"#N/A"}},{"$f":"VLOOKUP(Credits_PolicyYear_Input&'Calculation Links'!$J6,Differentials,HLOOKUP(AI$24,Differentials,2,FALSE),FALSE)","v":{"$error":"#N/A"}},"R","R",null,null,"Frankton Flats","Urban"]
{"$rows_left_out":62}
{"sheet":"Policy Inputs","index":9,"n_rows":187,"n_cols":90,"rows_kept":187,"cut":false,"hidden":true,"merged":[[5,3,5,8],[19,3,19,8],[33,3,33,8],[0,3,0,9],[0,14,0,24],[1,14,1,15],[1,18,1,19],[1,20,1,21],[1,22,1,23],[47,14,47,24],[61,14,61,24],[0,49,0,50],[19,49,19,50],[33,49,33,50],[47,49,47,50],[5,49,5,50],[5,14,5,24],[19,14,19,24],[33,14,33,24],[19,29,19,39],[33,29,33,39],[47,29,47,39],[137,14,137,24],[137,49,137,50],[120,3,120,8],[137,3,137,8],[61,49,61,50],[104,14,104,24],[104,49,104,50],[120,14,120,24],[120,49,120,50],[75,14,75,24],[61,29,61,39],[75,29,75,39],[89,29,89,39],[104,29,104,39],[120,29,120,39],[137,29,137,39],[169,3,169,9],[169,14,169,24],[169,49,169,50],[10,78,10,89],[12,76,35,76],[47,3,47,8],[61,3,61,8],[75,3,75,8],[89,3,89,8],[104,3,104,8],[89,14,89,24],[89,49,89,50],[75,49,75,50],[153,3,153,9],[153,14,153,24],[153,49,153,50],[5,65,5,66],[0,29,0,39],[1,29,1,30],[1,33,1,34],[1,35,1,36],[1,37,1,38],[5,29,5,39],[0,65,0,66],[153,29,153,39],[169,29,169,39],[19,65,19,66],[33,65,33,66],[47,65,47,66],[61,65,61,66],[75,65,75,66],[89,65,89,66],[104,65,104,66],[120,65,120,66],[137,65,137,66],[153,65,153,66],[169,65,169,66]]}
[null,null,null,"Standard Contributions",null,null,null,null,null,null,null,null,null,null,"Land Use Differentials",null,null,null,null,null,null,null,null,null,null,null,null,null,null,"Land Use Differential Type",null,null,null,null,null,null,null,null,null,null,null,null,null,null,"Impermeable Surface Area Estimates",null,null,null,null,"Estimating GFA Table",null,null,null,null,null,"Roading - Primary Industry Area",null,null,null,null,"Base GFA",null,null,null,null,"Reserve Land Prices (GST Inclusive)"]
[null,null,null,null,null,null,null,null,null,null,null,null,null,null,"Water Supply",null,"Wastewater","Stormwater","Reserve Improvements & Community Facilities",null,"Reserve Land",null,"Roading",null,"Roading - EAR",null,null,null,null,"Water Supply",null,"Wastewater","Stormwater","Reserve Improvements & Community Facilities",null,"Reserve Land",null,"Roading",null,"Roading - EAR"]
[null,null,null,"Water Supply","Wastewater","Stormwater","Reserve Improvements","Community Facilities","Transportation","Transportation - EAR",null,null,null,null,"Dwelling Equivalents per 100m² GFA","Plus Network Factor Dwelling Equivalents","Dwelling Equivalents per 100m² GFA","Dwelling Equivalents per 100m² Impervious Surface Area","Dwelling Equivalents per 100m² GFA for Wakatipu","Dwelling Equivalents per 100m² GFA for Wanaka","Dwelling Equivalents per 100m² GFA for Wakatipu","Dwelling Equivalents per 100m² GFA for Wanaka","Dwelling Equivalents per 100m² GFA for Wakatipu","Dwelling Equivalents per 100m² GFA for Wanaka","Dwelling Equivalents per 100m² GFA for Wakatipu",null,null,null,null,"Dwelling Equivalents per 100m² GFA","Plus Network Factor Dwelling Equivalents","Dwelling Equivalents per 100m² GFA","Dwelling Equivalents per 100m² Impervious Surface Area","Dwelling Equivalents per 100m² GFA for Wakatipu","Dwelling Equivalents per 100m² GFA for Wanaka","Dwelling Equivalents per 100m² GFA for Wakatipu","Dwelling Equivalents per 100m² GFA for Wanaka","Dwelling Equivalents per 100m² GFA for Wakatipu","Dwelling Equivalents per 100m² GFA for Wanaka","Dwelling Equivalents per 100m² GFA for Wakatipu",null,null,null,null,"Building Coverage",null,null,null,null,"Building Coverage","No. of Floors",null,null,null,null,"Area per 1.3 DE's (m2)",null,null,null,null,"Base GFA (m2)",null,null,null,null,"Township","Urban"]
[null,null,null,{"$f":"D3","v":"Water Supply"},"Wastewater","Stormwater","Reserve Improvements","Community Facilities",{"$f":"I3","v":"Transportation"},"Transportation - EAR",null,null,null,null,{"$f":"O2&O3","v":"Water SupplyDwelling Equivalents per 100m² GFA"},{"$f":"O2&P3","v":"Water SupplyPlus Network Factor Dwelling Equivalents"},{"$f":"Q2&Q3","v":"WastewaterDwelling Equivalents per 100m² GFA"},"StormwaterDwelling Equivalents per 100m² Impervious Surface Area","Reserve Improvements & Community FacilitiesDwelling Equivalents per 100m² GFA for Wakatipu",{"$f":"S2&T3","v":"Reserve Improvements & Community FacilitiesDwelling Equivalents per 100m² GFA for Wanaka"},"Reserve LandDwelling Equivalents per 100m² GFA for Wakatipu",{"$f":"U2&V3","v":"Reserve LandDwelling Equivalents per 100m² GFA for Wanaka"},{"$f":"W2&W3","v":"RoadingDwelling Equivalents per 100m² GFA for Wakatipu"},{"$f":"W2&X3","v":"RoadingDwelling Equivalents per 100m² GFA for Wanaka"},"Roading - EARDwelling Equivalents per 100m² GFA for Wakatipu",null,null,null,null,{"$f":"AD2&AD3","v":"Water SupplyDwelling Equivalents per 100m² GFA"},{"$f":"AD2&AE3","v":"Water SupplyPlus Network Factor Dwelling Equivalents"},{"$f":"AF2&AF3","v":"WastewaterDwelling Equivalents per 100m² GFA"},{"$f":"AG2&AG3","v":"StormwaterDwelling Equivalents per 100m² Impervious Surface Area"},{"$f":"AH2&AH3","v":"Reserve Improvements & Community FacilitiesDwelling Equivalents per 100m² GFA for Wakatipu"},{"$f":"AH2&AI3","v":"Reserve Improvements & Community FacilitiesDwelling Equivalents per 100m² GFA for Wanaka"},{"$f":"AJ2&AJ3","v":"Reserve LandDwelling Equivalents per 100m² GFA for Wakatipu"},{"$f":"AJ2&AK3","v":"Reserve LandDwelling Equivalents per 100m² GFA for Wanaka"},{"$f":"AL2&AL3","v":"RoadingDwelling Equivalents per 100m² GFA for Wakatipu"},{"$f":"AL2&AM3","v":"RoadingDwelling Equivalents per 100m² GFA for Wanaka"},{"$f":"AN2&AN3","v":"Roading - EARDwelling Equivalents per 100m² GFA for Wakatipu"},null,null,null,null,{"$f":"AS3","v":"Building Coverage"},null,null,null,null,{"$f":"AX3","v":"Building Coverage"},{"$f":"AY3","v":"No. of Floors"},null,null,null,null,{"$f":"BD3","v":"Area per 1.3 DE's (m2)"},null,null,null,null,{"$f":"BI3","v":"Base GFA (m2)"},null,null,null,null,{"$f":"BN3","v":"Township"},{"$f":"BO3","v":"Urban"}]
[null,null,1,{"$f":"C5+1","v":2},3,4,5,6,7,8,null,null,null,1,{"$f":"N5+1","v":2},3,4,5,6,7,8,9,10,11,12,null,null,null,1,{"$f":"AC5+1","v":2},3,4,5,6,7,8,9,10,11,12,null,null,null,1,{"$f":"AR5+1","v":2},null,null,null,1,{"$f":"AW5+1","v":2},{"$f":"AX5+1","v":3},null,null,null,1,{"$f":"BC5+1","v":2},null,null,null,1,{"$f":"BH5+1","v":2}]
[null,null,null,"2007/08",null,null,null,null,null,null,null,null,null,null,{"$f":"D6","v":"2007/08"},null,null,null,null,null,null,null,null,null,null,null,null,null,null,{"$f":"O6","v":"2007/08"},null,null,null,null,null,null,null,null,null,null,null,null,null,null,{"$f":"O6","v":"2007/08"},null,null,null,null,{"$f":"AS6","v":"2007/08"},null,null,null,null,null,{"$f":"AX6","v":"2007/08"},null,null,null,null,{"$f":"BD6","v":"2007/08"},null,null,null,null,{"$f":"BI6","v":"2007/08"}]
{"$rows_left_out":182}
{"sheet":"Validation Lists","index":10,"n_rows":17,"n_cols":13,"rows_kept":17,"cut":false,"hidden":true,"merged":[]}
["No. of Land Uses",null,"Credit Land Uses",null,"Land Uses",null,"Development or Subdivision",null,"Required or Not Required",null,"GST Options",null,"Policy Year"]
[1,null,{"$f":"IF(Credits_PolicyYear_Input<>\"2018/19\",'Policy Inputs'!M155,'Policy Inputs'!M171)","v":"Residential"},null,{"$f":"IF(Policy_Year_Input<>\"2018/19\",'Policy Inputs'!M155,'Policy Inputs'!M171)","v":"Residential"},null,"Development",null,"Required",null,0,null,"2008/09"]
[2,null,{"$f":"IF(Credits_PolicyYear_Input<>\"2018/19\",'Policy Inputs'!M156,'Policy Inputs'!M172)","v":"Residential Flat"},null,{"$f":"IF(Policy_Year_Input<>\"2018/19\",'Policy Inputs'!M156,'Policy Inputs'!M172)","v":"Residential Flat"},null,"Subdivision",null,"Not Required",null,0.15,null,"2009/10"]
[3,null,{"$f":"IF(Credits_PolicyYear_Input<>\"2018/19\",'Policy Inputs'!M157,'Policy Inputs'!M173)","v":"Multi Unit Residential"},null,{"$f":"IF(Policy_Year_Input<>\"2018/19\",'Policy Inputs'!M157,'Policy Inputs'!M173)","v":"Multi Unit Residential"},null,null,null,null,null,0.125,null,"2010/11"]
[4,null,{"$f":"IF(Credits_PolicyYear_Input<>\"2018/19\",'Policy Inputs'!M158,'Policy Inputs'!M174)","v":"Accommodation"},null,{"$f":"IF(Policy_Year_Input<>\"2018/19\",'Policy Inputs'!M158,'Policy Inputs'!M174)","v":"Country Dwelling"},null,null,null,null,null,null,null,"2011/12"]
[null,null,{"$f":"IF(Credits_PolicyYear_Input<>\"2018/19\",'Policy Inputs'!M159,'Policy Inputs'!M175)","v":"Commercial"},null,{"$f":"IF(Policy_Year_Input<>\"2018/19\",'Policy Inputs'!M159,'Policy Inputs'!M175)","v":"Retirement units"},null,null,null,null,null,null,null,"2012/13"]
{"$rows_left_out":12}
{"sheet":"Version History","index":11,"n_rows":11,"n_cols":3,"rows_kept":11,"cut":false,"hidden":true,"merged":[]}
["Version History"]
[]
["Version","Address","Change from previous"]
["16 v Final","https://rationaleltd.sharepoint.com/AppPages/documents.aspx#/Shared Documents1/Clients/QLDC/Jobs/J000564 - DCN Assistance - 201617/DC Assessment Tool - 16 vFinal.xlsm"]
["16 v Final_Updated","https://rationaleltd.sharepoint.com/AppPages/documents.aspx#/Shared Documents1/Clients/QLDC/Jobs/J000564 - DCN Assistance - 201617/DC Assessment Tool - 16 vFinal_Updated.xlsm"]
["16 v Final_Updated v1.0","https://rationaleltd.sharepoint.com/AppPages/documents.aspx#/Shared Documents1/Clients/QLDC/Jobs/J000564 - DCN Assistance - 201617/DC Assessment Tool - 16 vFinal_Updated v1.0.xlsm"," Country dwelling NCF corrected and now includes 0.4DE.\n Calculation of residual credits now rolled into one overall post and pre development demand (DE).\n Corrected the rounding to 2 decimal places."]
{"$rows_left_out":5}